Finish consitfying showbuf()

14 jobs for master in 7 minutes and 36 seconds (queued for 15 seconds)
Status Job ID Name Coverage
  Build
failed #30572
FreeBSD
jsdoor-freebsd

00:03:32

failed #30573
Linux
jsdoor-linux

00:06:12

failed #30575
FreeBSD
jsdoor-windows

00:01:22

failed #30567
FreeBSD
sbbs-freebsd

00:03:33

failed #30562
Linux
sbbs-linux

00:06:10

failed #30565
Windows
sbbs-windows

00:02:33

passed #30574
FreeBSD
sexpots-freebsd

00:00:12

passed #30563
Linux
sexpots-linux

00:00:15

passed #30566
Windows
sexpots-windows

00:00:34

passed #30570
FreeBSD
syncdraw-freebsd

00:00:23

passed #30571
Linux
syncdraw-linux

00:01:05

failed #30568
FreeBSD
syncterm-freebsd

00:00:15

failed #30564
Linux
syncterm-linux

00:00:48

failed #30569
FreeBSD
syncterm-windows

00:00:20

 
Name Stage Failure
failed
jsdoor-linux Build
                    ^
uifc32.c:2772:9: warning: assignment discards ‘const’ qualifier from pointer target type [-Wdiscarded-qualifiers]
for(pc=title;*pc;pc++) {
^
make[1]: *** [../build/Common.gmake:462: gcc.linux.x64.obj.release-mt/uifc32.o] Error 1
make[1]: Leaving directory '/home/gitlab-runner/builds/vLEE6HYB/0/main/sbbs/src/uifc'
make: *** [/home/gitlab-runner/builds/vLEE6HYB/0/main/sbbs/src/sbbs3/../build/Common.gmake:517: uifc-mt] Error 2
Cleaning up file based variables
ERROR: Job failed: exit status 1
failed
sbbs-linux Build
     ^~~~~~~~~~~~~~~~~
In file included from sbbs.h:291,
from atcodes.cpp:22:
str_util.h:70:18: note: previous declaration ‘char* utf8_to_cp437_str(char*)’
DLLEXPORT char * utf8_to_cp437_str(char* str);
^~~~~~~~~~~~~~~~~
make: *** [/home/gitlab-runner/builds/vLEE6HYB/3/main/sbbs/src/sbbs3/../build/Common.gmake:467: gcc.linux.x64.obj.release-mt/atcodes.o] Error 1
Cleaning up file based variables
ERROR: Job failed: exit status 1
failed
jsdoor-freebsd Build
uifc32.c:2772:9: warning: assigning to 'char *' from 'const char *' discards qualifiers [-Wincompatible-pointer-types-discards-qualifiers]
for(pc=title;*pc;pc++) {
^~~~~~
1 warning and 1 error generated.
gmake[1]: *** [../build/Common.gmake:462: clang.freebsd.amd64.obj.release-mt/uifc32.o] Error 1
gmake[1]: Leaving directory '/var/tmp/gitlab_runner/builds/TkL89aUh/3/main/sbbs/src/uifc'
gmake: *** [/var/tmp/gitlab_runner/builds/TkL89aUh/3/main/sbbs/src/sbbs3/../build/Common.gmake:517: uifc-mt] Error 2
Cleaning up file based variables
ERROR: Job failed: exit status 1
failed
sbbs-freebsd Build
int utf8_to_cp437_str(const char *src, char *dest, size_t maxlen, unsigned char minval, size_t *outlen);
~~~ ^
./str_util.h:70:18: note: previous declaration is here
DLLEXPORT char * utf8_to_cp437_str(char* str);
~~~~~~ ^
1 error generated.
gmake: *** [/var/tmp/gitlab_runner/builds/TkL89aUh/1/main/sbbs/src/sbbs3/../build/Common.gmake:467: clang.freebsd.amd64.obj.release-mt/atcodes.o] Error 1
Cleaning up file based variables
ERROR: Job failed: exit status 1
failed
sbbs-windows Build

75 Warning(s)
14 Error(s)

Time Elapsed 00:02:01.19

!ERROR(s) occurred
Cleaning up file based variables
ERROR: Job failed: exit status 1
failed
jsdoor-windows Build
    ^
uifc32.c:2772:9: warning: assignment discards 'const' qualifier from pointer target type [enabled by default]
for(pc=title;*pc;pc++) {
^
gmake[1]: *** [../build/Common.gmake:462: gcc.win32.amd64.obj.release-mt/uifc32.o] Error 1
gmake[1]: Leaving directory '/var/tmp/gitlab_runner/builds/TkL89aUh/4/main/sbbs/src/uifc'
gmake: *** [/var/tmp/gitlab_runner/builds/TkL89aUh/4/main/sbbs/src/sbbs3/../build/Common.gmake:517: uifc-mt] Error 2
Cleaning up file based variables
ERROR: Job failed: exit status 1
failed
syncterm-linux Build
                    ^
uifc32.c:2772:9: warning: assignment discards ‘const’ qualifier from pointer target type [-Wdiscarded-qualifiers]
for(pc=title;*pc;pc++) {
^
make[1]: *** [../build/Common.gmake:462: gcc.linux.x64.obj.release-mt/uifc32.o] Error 1
make[1]: Leaving directory '/home/gitlab-runner/builds/vLEE6HYB/3/main/sbbs/src/uifc'
make: *** [../build/Common.gmake:517: uifc-mt] Error 2
Cleaning up file based variables
ERROR: Job failed: exit status 1
failed
syncterm-windows Build
    ^
uifc32.c:2772:9: warning: assignment discards 'const' qualifier from pointer target type [enabled by default]
for(pc=title;*pc;pc++) {
^
gmake[1]: *** [../build/Common.gmake:462: gcc.win32.amd64.obj.release-mt/uifc32.o] Error 1
gmake[1]: Leaving directory '/var/tmp/gitlab_runner/builds/TkL89aUh/4/main/sbbs/src/uifc'
gmake: *** [../build/Common.gmake:517: uifc-mt] Error 2
Cleaning up file based variables
ERROR: Job failed: exit status 1
failed
syncterm-freebsd Build
uifc32.c:2772:9: warning: assigning to 'char *' from 'const char *' discards qualifiers [-Wincompatible-pointer-types-discards-qualifiers]
for(pc=title;*pc;pc++) {
^~~~~~
1 warning and 1 error generated.
gmake[1]: *** [../build/Common.gmake:462: clang.freebsd.amd64.obj.release-mt/uifc32.o] Error 1
gmake[1]: Leaving directory '/var/tmp/gitlab_runner/builds/TkL89aUh/3/main/sbbs/src/uifc'
gmake: *** [../build/Common.gmake:517: uifc-mt] Error 2
Cleaning up file based variables
ERROR: Job failed: exit status 1