More Win32 optimizations.

14 jobs for master in 8 minutes and 46 seconds (queued for 15 seconds)
Status Name Job ID Coverage
  Build
passed jsdoor-freebsd #30880
FreeBSD

00:04:28

canceled jsdoor-linux #30881
Linux

00:02:15

failed jsdoor-windows #30883
FreeBSD

00:01:21

passed sbbs-freebsd #30875
FreeBSD

00:06:15

canceled sbbs-linux #30870
Linux

00:07:29

failed sbbs-windows #30873
Windows

00:00:13

passed sexpots-freebsd #30882
FreeBSD

00:00:29

passed sexpots-linux #30871
Linux

00:00:15

failed sexpots-windows #30874
Windows

00:00:21

passed syncdraw-freebsd #30878
FreeBSD

00:00:39

passed syncdraw-linux #30879
Linux

00:00:55

passed syncterm-freebsd #30876
FreeBSD

00:01:21

passed syncterm-linux #30872
Linux

00:03:24

failed syncterm-windows #30877
FreeBSD

00:00:28

 
Name Stage Failure
failed
jsdoor-windows Build
genwrap.c:853:35: error: 'freq' undeclared (first use in this function)
if (!QueryPerformanceFrequency(&freq))
^
genwrap.c:853:35: note: each undeclared identifier is reported only once for each function it appears in
gmake[1]: *** [../build/Common.gmake:462: gcc.win32.amd64.obj.release-mt/genwrap.o] Error 1
gmake[1]: Leaving directory '/var/tmp/gitlab_runner/builds/TkL89aUh/1/main/sbbs/src/xpdev'
gmake: *** [/var/tmp/gitlab_runner/builds/TkL89aUh/1/main/sbbs/src/sbbs3/../build/Common.gmake:493: xpdev-mt] Error 2
Cleaning up file based variables
ERROR: Job failed: exit status 1
failed
syncterm-windows Build
genwrap.c:853:35: error: 'freq' undeclared (first use in this function)
if (!QueryPerformanceFrequency(&freq))
^
genwrap.c:853:35: note: each undeclared identifier is reported only once for each function it appears in
gmake[1]: *** [../build/Common.gmake:462: gcc.win32.amd64.obj.release-mt/genwrap.o] Error 1
gmake[1]: Leaving directory '/var/tmp/gitlab_runner/builds/TkL89aUh/1/main/sbbs/src/xpdev'
gmake: *** [../build/Common.gmake:493: xpdev-mt] Error 2
Cleaning up file based variables
ERROR: Job failed: exit status 1
failed
sexpots-windows Build

2 Warning(s)
7 Error(s)

Time Elapsed 00:00:07.72

!ERROR(s) occurred
Cleaning up file based variables
ERROR: Job failed: exit status 1
failed
sbbs-windows Build
.\genwrap.c:
Warning W8065 .\genwrap.c 698: Call to function 'roundl' with no prototype in function msclock
Warning W8008 .\genwrap.c 700: Condition is always true in function msclock
Error E2451 .\genwrap.c 853: Undefined symbol 'freq' in function xp_timer64
*** 1 errors in Compile ***

** error 1 ** deleting bcc.win32.obj.debug\genwrap.obj
Cleaning up file based variables
ERROR: Job failed: exit status 1