Make ciolib_appname const

14 jobs for master in 6 minutes and 49 seconds (queued for 12 seconds)
Status Job ID Name Coverage
  Build
failed #31972
FreeBSD
jsdoor-freebsd

00:03:24

failed #31973
Linux
jsdoor-linux

00:04:39

failed #31975
FreeBSD
jsdoor-windows

00:01:13

failed #31967
FreeBSD
sbbs-freebsd

00:04:29

failed #31962
Linux
sbbs-linux

00:06:47

failed #31965
Windows
sbbs-windows

00:04:43

passed #31974
FreeBSD
sexpots-freebsd

00:00:11

passed #31963
Linux
sexpots-linux

00:00:24

passed #31966
Windows
sexpots-windows

00:00:30

failed #31970
FreeBSD
syncdraw-freebsd

00:00:15

failed #31971
Linux
syncdraw-linux

00:00:34

failed #31968
FreeBSD
syncterm-freebsd

00:00:12

failed #31964
Linux
syncterm-linux

00:00:20

failed #31969
FreeBSD
syncterm-windows

00:00:11

 
Name Stage Failure
failed
sbbs-linux Build
In file included from ciolib.c:52:
ciolib.h:398:29: note: previous declaration of ‘ciolib_appname’ was here
CIOLIBEXPORTVAR const char *ciolib_appname;
^~~~~~~~~~~~~~
make[1]: *** [../build/Common.gmake:462: gcc.linux.x64.obj.release-mt/ciolib.o] Error 1
make[1]: Leaving directory '/home/gitlab-runner/builds/vLEE6HYB/1/main/sbbs/src/conio'
make: *** [/home/gitlab-runner/builds/vLEE6HYB/1/main/sbbs/src/sbbs3/../build/Common.gmake:509: ciolib-mt] Error 2
Cleaning up file based variables
ERROR: Job failed: exit status 1
failed
jsdoor-linux Build
 CIOLIBEXPORTVAR const char *ciolib_appname;
^~~~~~~~~~~~~~
make[2]: *** [../build/Common.gmake:462: gcc.linux.x64.obj.release-mt/ciolib.o] Error 1
make[2]: Leaving directory '/home/gitlab-runner/builds/vLEE6HYB/3/main/sbbs/src/conio'
make[1]: *** [../build/Common.gmake:509: ciolib-mt] Error 2
make[1]: Leaving directory '/home/gitlab-runner/builds/vLEE6HYB/3/main/sbbs/src/uifc'
make: *** [/home/gitlab-runner/builds/vLEE6HYB/3/main/sbbs/src/sbbs3/../build/Common.gmake:517: uifc-mt] Error 2
Cleaning up file based variables
ERROR: Job failed: exit status 1
failed
sbbs-windows Build

63 Warning(s)
1 Error(s)

Time Elapsed 00:04:13.89

!ERROR(s) occurred
Cleaning up file based variables
ERROR: Job failed: exit status 1
failed
sbbs-freebsd Build
../conio/ciolib.h:398:29: note: previous declaration is here
CIOLIBEXPORTVAR const char *ciolib_appname;
^
1 error generated.
gmake[1]: *** [../build/Common.gmake:462: clang.freebsd.amd64.obj.release-mt/ciolib.o] Error 1
gmake[1]: Leaving directory '/var/tmp/gitlab_runner/builds/TkL89aUh/1/main/sbbs/src/conio'
gmake: *** [/var/tmp/gitlab_runner/builds/TkL89aUh/1/main/sbbs/src/sbbs3/../build/Common.gmake:509: ciolib-mt] Error 2
Cleaning up file based variables
ERROR: Job failed: exit status 1
failed
jsdoor-freebsd Build
                            ^
1 error generated.
gmake[2]: *** [../build/Common.gmake:462: clang.freebsd.amd64.obj.release-mt/ciolib.o] Error 1
gmake[2]: Leaving directory '/var/tmp/gitlab_runner/builds/TkL89aUh/4/main/sbbs/src/conio'
gmake[1]: *** [../build/Common.gmake:509: ciolib-mt] Error 2
gmake[1]: Leaving directory '/var/tmp/gitlab_runner/builds/TkL89aUh/4/main/sbbs/src/uifc'
gmake: *** [/var/tmp/gitlab_runner/builds/TkL89aUh/4/main/sbbs/src/sbbs3/../build/Common.gmake:517: uifc-mt] Error 2
Cleaning up file based variables
ERROR: Job failed: exit status 1
failed
jsdoor-windows Build
 CIOLIBEXPORTVAR const char *ciolib_appname;
^
gmake[2]: *** [../build/Common.gmake:462: gcc.win32.amd64.obj.release-mt/ciolib.o] Error 1
gmake[2]: Leaving directory '/var/tmp/gitlab_runner/builds/TkL89aUh/0/main/sbbs/src/conio'
gmake[1]: *** [../build/Common.gmake:509: ciolib-mt] Error 2
gmake[1]: Leaving directory '/var/tmp/gitlab_runner/builds/TkL89aUh/0/main/sbbs/src/uifc'
gmake: *** [/var/tmp/gitlab_runner/builds/TkL89aUh/0/main/sbbs/src/sbbs3/../build/Common.gmake:517: uifc-mt] Error 2
Cleaning up file based variables
ERROR: Job failed: exit status 1
failed
syncdraw-linux Build
In file included from ciolib.c:52:
ciolib.h:398:29: note: previous declaration of ‘ciolib_appname’ was here
CIOLIBEXPORTVAR const char *ciolib_appname;
^~~~~~~~~~~~~~
make[1]: *** [../build/Common.gmake:462: gcc.linux.x64.obj.release-mt/ciolib.o] Error 1
make[1]: Leaving directory '/home/gitlab-runner/builds/vLEE6HYB/0/main/sbbs/src/conio'
make: *** [../build/Common.gmake:509: ciolib-mt] Error 2
Cleaning up file based variables
ERROR: Job failed: exit status 1
failed
syncterm-linux Build
In file included from ciolib.c:52:
ciolib.h:398:29: note: previous declaration of ‘ciolib_appname’ was here
CIOLIBEXPORTVAR const char *ciolib_appname;
^~~~~~~~~~~~~~
make[1]: *** [../build/Common.gmake:462: gcc.linux.x64.obj.release-mt/ciolib.o] Error 1
make[1]: Leaving directory '/home/gitlab-runner/builds/vLEE6HYB/3/main/sbbs/src/conio'
make: *** [../build/Common.gmake:509: ciolib-mt] Error 2
Cleaning up file based variables
ERROR: Job failed: exit status 1
failed
syncdraw-freebsd Build
../conio/ciolib.h:398:29: note: previous declaration is here
CIOLIBEXPORTVAR const char *ciolib_appname;
^
1 error generated.
gmake[1]: *** [../build/Common.gmake:462: clang.freebsd.amd64.obj.release-mt/ciolib.o] Error 1
gmake[1]: Leaving directory '/var/tmp/gitlab_runner/builds/TkL89aUh/3/main/sbbs/src/conio'
gmake: *** [../build/Common.gmake:509: ciolib-mt] Error 2
Cleaning up file based variables
ERROR: Job failed: exit status 1
failed
syncterm-windows Build
In file included from ciolib.c:52:0:
ciolib.h:398:29: note: previous declaration of 'ciolib_appname' was here
CIOLIBEXPORTVAR const char *ciolib_appname;
^
gmake[1]: *** [../build/Common.gmake:462: gcc.win32.amd64.obj.release-mt/ciolib.o] Error 1
gmake[1]: Leaving directory '/var/tmp/gitlab_runner/builds/TkL89aUh/2/main/sbbs/src/conio'
gmake: *** [../build/Common.gmake:509: ciolib-mt] Error 2
Cleaning up file based variables
ERROR: Job failed: exit status 1
failed
syncterm-freebsd Build
../conio/ciolib.h:398:29: note: previous declaration is here
CIOLIBEXPORTVAR const char *ciolib_appname;
^
1 error generated.
gmake[1]: *** [../build/Common.gmake:462: clang.freebsd.amd64.obj.release-mt/ciolib.o] Error 1
gmake[1]: Leaving directory '/var/tmp/gitlab_runner/builds/TkL89aUh/0/main/sbbs/src/conio'
gmake: *** [../build/Common.gmake:509: ciolib-mt] Error 2
Cleaning up file based variables
ERROR: Job failed: exit status 1