load_cfg now depends on readtext and text_defaults... everywhere

Needed for text.dat support in SBBSecho

load_cfg really should be made either a static library or an exported
function from libsbbs.so that everything reuses. Kind of silly to be
recompiling and linking these files with every app now.
14 jobs for master in 9 minutes and 1 second (queued for 12 seconds)
Status Job ID Name Coverage
  Build
passed #32070
FreeBSD
jsdoor-freebsd

00:04:05

passed #32071
Linux
jsdoor-linux

00:06:13

passed #32073
FreeBSD
jsdoor-windows

00:02:00

failed #32065
FreeBSD
sbbs-freebsd

00:05:00

failed #32060
Linux
sbbs-linux

00:08:55

passed #32063
Windows
sbbs-windows

00:05:24

passed #32072
FreeBSD
sexpots-freebsd

00:00:13

passed #32061
Linux
sexpots-linux

00:00:21

passed #32064
Windows
sexpots-windows

00:00:24

passed #32068
FreeBSD
syncdraw-freebsd

00:00:24

passed #32069
Linux
syncdraw-linux

00:01:00

passed #32066
FreeBSD
syncterm-freebsd

00:01:03

passed #32062
Linux
syncterm-linux

00:02:49

passed #32067
FreeBSD
syncterm-windows

00:01:50

 
Name Stage Failure
failed
sbbs-linux Build
qwknodes.c:(.text.startup+0x16c): undefined reference to `fnopen'
/usr/bin/ld: qwknodes.c:(.text.startup+0x192): undefined reference to `get_ctrl_dir'
/usr/bin/ld: qwknodes.c:(.text.startup+0x1d1): undefined reference to `load_cfg'
/usr/bin/ld: qwknodes.c:(.text.startup+0x8b5): undefined reference to `fnopen'
/usr/bin/ld: qwknodes.c:(.text.startup+0x8f3): undefined reference to `fnopen'
collect2: error: ld returned 1 exit status
make: *** [GNUmakefile:236: gcc.linux.x64.exe.release/qwknodes] Error 1
Cleaning up file based variables
ERROR: Job failed: exit status 1
failed
sbbs-freebsd Build
>>>               clang.freebsd.amd64.obj.release/qwknodes.o:(main)

ld: error: undefined symbol: load_cfg
>>> referenced by qwknodes.c
>>> clang.freebsd.amd64.obj.release/qwknodes.o:(main)
cc: error: linker command failed with exit code 1 (use -v to see invocation)
gmake: *** [GNUmakefile:236: clang.freebsd.amd64.exe.release/qwknodes] Error 1
Cleaning up file based variables
ERROR: Job failed: exit status 1