Synchronet now requires the libarchive development package (e.g. libarchive-dev on Debian-based Linux distros, libarchive.org for more info) to build successfully.

Spaces -> Tabs

Tabs are the shit.
14 jobs for master in 11 minutes and 5 seconds (queued for 13 seconds)
Status Job ID Name Coverage
  Build
passed #18560
FreeBSD
jsdoor-freebsd

00:05:46

failed #18561
Linux
jsdoor-linux

00:00:07

passed #18563
FreeBSD
jsdoor-windows

00:02:54

passed #18555
FreeBSD
sbbs-freebsd

00:07:55

passed #18550
Linux
sbbs-linux

00:11:03

passed #18553
Windows
sbbs-windows

00:05:20

passed #18562
FreeBSD
sexpots-freebsd

00:00:14

passed #18551
Linux
sexpots-linux

00:00:13

passed #18554
Windows
sexpots-windows

00:00:27

passed #18558
FreeBSD
syncdraw-freebsd

00:00:31

passed #18559
Linux
syncdraw-linux

00:01:01

passed #18556
FreeBSD
syncterm-freebsd

00:01:23

failed #18552
Linux
syncterm-linux

00:00:13

passed #18557
FreeBSD
syncterm-windows

00:02:27

 
Name Stage Failure
failed
jsdoor-linux Build
checking for doxygen... :
checking for autoconf... :
checking for unzip... :
checking for zip... no
configure: error: zip not found in $PATH
make[1]: *** [GNUmakefile:74: ../build/../../src/../3rdp/gcc.linux.x64.release/mozjs/lib/libmozjs185-1.0.a] Error 1
make[1]: Leaving directory '/var/lib/gitlab-runner/builds/yxBmy8wo/0/main/sbbs/3rdp/build'
make: *** [/var/lib/gitlab-runner/builds/yxBmy8wo/0/main/sbbs/src/sbbs3/../build/Common.gmake:521: js] Error 2
ERROR: Job failed: exit status 1
failed
syncterm-linux Build
make -C ../../3rdp/build cryptlib
make[1]: Entering directory '/var/lib/gitlab-runner/builds/yxBmy8wo/0/main/sbbs/3rdp/build'
/bin/sh: 1: pkg-config: not found
Creating ../build/../../src/../3rdp/gcc.linux.x64.release/cl/libcl.a ...
make[1]: unzip: Command not found
make[1]: *** [GNUmakefile:87: ../build/../../src/../3rdp/gcc.linux.x64.release/cl/libcl.a] Error 127
make[1]: Leaving directory '/var/lib/gitlab-runner/builds/yxBmy8wo/0/main/sbbs/3rdp/build'
make: *** [../build/Common.gmake:525: cl] Error 2
ERROR: Job failed: exit status 1