Use xp_timer64() instead of xp_timer()

14 jobs for master in 3 minutes and 48 seconds (queued for 15 seconds)
Status Job ID Name Coverage
  Build
canceled #30810
FreeBSD
jsdoor-freebsd

00:03:48

canceled #30811
Linux
jsdoor-linux

failed #30813
FreeBSD
jsdoor-windows

00:01:05

canceled #30805
FreeBSD
sbbs-freebsd

00:03:43

canceled #30800
Linux
sbbs-linux

failed #30803
Windows
sbbs-windows

00:00:12

passed #30812
FreeBSD
sexpots-freebsd

00:00:10

canceled #30801
Linux
sexpots-linux

failed #30804
Windows
sexpots-windows

00:00:21

passed #30808
FreeBSD
syncdraw-freebsd

00:00:22

canceled #30809
Linux
syncdraw-linux

passed #30806
FreeBSD
syncterm-freebsd

00:01:00

canceled #30802
Linux
syncterm-linux

failed #30807
FreeBSD
syncterm-windows

00:00:05

 
Name Stage Failure
failed
jsdoor-windows Build
  ^
genwrap.c:862:1: error: expected expression before '}' token
}
^
gmake[1]: *** [../build/Common.gmake:462: gcc.win32.amd64.obj.release-mt/genwrap.o] Error 1
gmake[1]: Leaving directory '/var/tmp/gitlab_runner/builds/TkL89aUh/4/main/sbbs/src/xpdev'
gmake: *** [/var/tmp/gitlab_runner/builds/TkL89aUh/4/main/sbbs/src/sbbs3/../build/Common.gmake:493: xpdev-mt] Error 2
Cleaning up file based variables
ERROR: Job failed: exit status 1
failed
sexpots-windows Build

1 Warning(s)
5 Error(s)

Time Elapsed 00:00:07.82

!ERROR(s) occurred
Cleaning up file based variables
ERROR: Job failed: exit status 1
failed
sbbs-windows Build
Warning W8065 .\genwrap.c 698: Call to function 'roundl' with no prototype in function msclock
Warning W8008 .\genwrap.c 700: Condition is always true in function msclock
Error E2188 .\genwrap.c 848: Expression syntax in function xp_timer64
Warning W8070 .\genwrap.c 862: Function should return a value in function xp_timer64
*** 1 errors in Compile ***

** error 1 ** deleting bcc.win32.obj.debug\genwrap.obj
Cleaning up file based variables
ERROR: Job failed: exit status 1
failed
syncterm-windows Build
  ^
genwrap.c:862:1: error: expected expression before '}' token
}
^
gmake[1]: *** [../build/Common.gmake:462: gcc.win32.amd64.obj.release-mt/genwrap.o] Error 1
gmake[1]: Leaving directory '/var/tmp/gitlab_runner/builds/TkL89aUh/4/main/sbbs/src/xpdev'
gmake: *** [../build/Common.gmake:493: xpdev-mt] Error 2
Cleaning up file based variables
ERROR: Job failed: exit status 1