More Win32 optimizations.

14 jobs for master in 8 minutes and 46 seconds (queued for 15 seconds)
Status Job ID Name Coverage
  Build
passed #30880
FreeBSD
jsdoor-freebsd

00:04:28

canceled #30881
Linux
jsdoor-linux

00:02:15

failed #30883
FreeBSD
jsdoor-windows

00:01:21

passed #30875
FreeBSD
sbbs-freebsd

00:06:15

canceled #30870
Linux
sbbs-linux

00:07:29

failed #30873
Windows
sbbs-windows

00:00:13

passed #30882
FreeBSD
sexpots-freebsd

00:00:29

passed #30871
Linux
sexpots-linux

00:00:15

failed #30874
Windows
sexpots-windows

00:00:21

passed #30878
FreeBSD
syncdraw-freebsd

00:00:39

passed #30879
Linux
syncdraw-linux

00:00:55

passed #30876
FreeBSD
syncterm-freebsd

00:01:21

passed #30872
Linux
syncterm-linux

00:03:24

failed #30877
FreeBSD
syncterm-windows

00:00:28

 
Name Stage Failure
failed
jsdoor-windows Build
genwrap.c:853:35: error: 'freq' undeclared (first use in this function)
if (!QueryPerformanceFrequency(&freq))
^
genwrap.c:853:35: note: each undeclared identifier is reported only once for each function it appears in
gmake[1]: *** [../build/Common.gmake:462: gcc.win32.amd64.obj.release-mt/genwrap.o] Error 1
gmake[1]: Leaving directory '/var/tmp/gitlab_runner/builds/TkL89aUh/1/main/sbbs/src/xpdev'
gmake: *** [/var/tmp/gitlab_runner/builds/TkL89aUh/1/main/sbbs/src/sbbs3/../build/Common.gmake:493: xpdev-mt] Error 2
Cleaning up file based variables
ERROR: Job failed: exit status 1
failed
syncterm-windows Build
genwrap.c:853:35: error: 'freq' undeclared (first use in this function)
if (!QueryPerformanceFrequency(&freq))
^
genwrap.c:853:35: note: each undeclared identifier is reported only once for each function it appears in
gmake[1]: *** [../build/Common.gmake:462: gcc.win32.amd64.obj.release-mt/genwrap.o] Error 1
gmake[1]: Leaving directory '/var/tmp/gitlab_runner/builds/TkL89aUh/1/main/sbbs/src/xpdev'
gmake: *** [../build/Common.gmake:493: xpdev-mt] Error 2
Cleaning up file based variables
ERROR: Job failed: exit status 1
failed
sexpots-windows Build

2 Warning(s)
7 Error(s)

Time Elapsed 00:00:07.72

!ERROR(s) occurred
Cleaning up file based variables
ERROR: Job failed: exit status 1
failed
sbbs-windows Build
.\genwrap.c:
Warning W8065 .\genwrap.c 698: Call to function 'roundl' with no prototype in function msclock
Warning W8008 .\genwrap.c 700: Condition is always true in function msclock
Error E2451 .\genwrap.c 853: Undefined symbol 'freq' in function xp_timer64
*** 1 errors in Compile ***

** error 1 ** deleting bcc.win32.obj.debug\genwrap.obj
Cleaning up file based variables
ERROR: Job failed: exit status 1