Enable ctypes in jsdoor

SpiderMokey is now built with ctypes, but the object is only
being created in jsdoor for now.
14 jobs for master in 10 minutes and 15 seconds (queued for 13 seconds)
Status Job ID Name Coverage
  Build
passed #32084
FreeBSD
jsdoor-freebsd

00:04:17

passed #32085
Linux
jsdoor-linux

00:07:10

passed #32087
FreeBSD
jsdoor-windows

00:01:58

failed #32079
FreeBSD
sbbs-freebsd

00:05:10

failed #32074
Linux
sbbs-linux

00:10:09

passed #32077
Windows
sbbs-windows

00:05:28

passed #32086
FreeBSD
sexpots-freebsd

00:00:13

passed #32075
Linux
sexpots-linux

00:00:15

passed #32078
Windows
sexpots-windows

00:00:25

passed #32082
FreeBSD
syncdraw-freebsd

00:00:25

passed #32083
Linux
syncdraw-linux

00:01:04

passed #32080
FreeBSD
syncterm-freebsd

00:01:04

passed #32076
Linux
syncterm-linux

00:03:01

passed #32081
FreeBSD
syncterm-windows

00:01:50

 
Name Stage Failure
failed
sbbs-linux Build
qwknodes.c:(.text.startup+0x16c): undefined reference to `fnopen'
/usr/bin/ld: qwknodes.c:(.text.startup+0x192): undefined reference to `get_ctrl_dir'
/usr/bin/ld: qwknodes.c:(.text.startup+0x1d1): undefined reference to `load_cfg'
/usr/bin/ld: qwknodes.c:(.text.startup+0x8b5): undefined reference to `fnopen'
/usr/bin/ld: qwknodes.c:(.text.startup+0x8f3): undefined reference to `fnopen'
collect2: error: ld returned 1 exit status
make: *** [GNUmakefile:236: gcc.linux.x64.exe.release/qwknodes] Error 1
Cleaning up file based variables
ERROR: Job failed: exit status 1
failed
sbbs-freebsd Build
>>>               clang.freebsd.amd64.obj.release/qwknodes.o:(main)

ld: error: undefined symbol: load_cfg
>>> referenced by qwknodes.c
>>> clang.freebsd.amd64.obj.release/qwknodes.o:(main)
cc: error: linker command failed with exit code 1 (use -v to see invocation)
gmake: *** [GNUmakefile:236: clang.freebsd.amd64.exe.release/qwknodes] Error 1
Cleaning up file based variables
ERROR: Job failed: exit status 1